{"text_format":"1","workbook":"xlsx","n_sheets":6,"sheets":["Registration","Risk assessment sheet","Gagnabanki - (Á)hættumat","Risk assessment bank","Importance of measures","Risk Matrix"],"not_rendered":{"charts":0,"images":3,"macros":1,"external_links":0,"defined_names":18,"comments":3,"pivot_tables":0},"unopened":[],"bounds":{"document_bytes":16777216,"sheet_cells":100000,"rows_first":2000,"rows_last":500,"rows_between":2000,"halvings":0,"cell_chars":16384,"cell_head_chars":4096},"cells_cut":0,"cells_raw":0,"read":"whole","date_system":"1900"}

{"sheet":"Registration","index":0,"n_rows":76,"n_cols":4,"rows_kept":76,"cut":false,"hidden":false,"merged":[]}
["NUMBER","WORK SECTION","RISK",{"$error":"#VALUE!"}]
[null,null,"Collision","Staff or pedestrians are exposed to machinery or parts of machinery"]
[null,null,"Collision","Staff involved in a collision"]
[null,null,"Collision","Staff hit by a vehicle "]
[null,null,"Collision","Pedestrians are hit by the company's vehicle"]
[null,null,"Fall/collapse","Staff falls on a ladder or stairs"]
[null,null,"Fall/collapse","Staff falls off a work platform"]
[null,null,"Fall/collapse","Staff falls from a pole"]
[null,null,"Fall/collapse","Staff fall from a work lift/spike or man basket"]
[null,null,"Fall/collapse","Staff fall from an edge"]
[null,null,"Fall/collapse","Staff/pedestrians falls into a pit, ditch, opening"]
[null,null,"Fall/collapse","Staff falls on a flat surface"]
[null,null,"Fall/collapse","Staff gets material falling on them from trench edges"]
[null,null,"Fall/collapse","Staff gets hit by tools or materials"]
[null,null,"Fall/collapse","Staff gets a load falling on them during lifting"]
{"$rows_left_out":62}
{"sheet":"Risk assessment sheet","index":1,"n_rows":69,"n_cols":10,"rows_kept":69,"cut":false,"hidden":false,"merged":[[2,1,2,2]]}
["Risk assesment:",null,null,"PPI at work:",null,null,null,{"$f":"IFERROR(INDEX('Risk Matrix'!$E$5:$I$9,MATCH(F1,'Risk Matrix'!$B$5:$B$9),MATCH(G1,'Risk Matrix'!$E$4:$I$4)),\"\")","v":""}]
["Responsibility:"]
["Participants:"]
["Date:",null,null,null,null,null,null,null,{"$f":"COUNTA(D:D)-5","v":-3},{"$f":"COUNTA(A:A)","v":5}]
["WORK SECTION","RISK","SCENIARO","CAUSES","RECOMMENDATIONS","CONSEQUENCES","LIKELIHOOD","RISK RATING","FURTHER ACTIONS"]
[null,null,null,null,null,null,null,{"$f":"IFERROR(INDEX('Risk Matrix'!$E$5:$I$9, MATCH(F6, 'Risk Matrix'!$B$5:$B$9, 0), MATCH(G6, 'Risk Matrix'!$E$4:$I$4, 0)), \"\")","v":""}]
[null,null,null,null,null,null,null,{"$f":"IFERROR(INDEX('Risk Matrix'!$E$5:$I$9, MATCH(F7, 'Risk Matrix'!$B$5:$B$9, 0), MATCH(G7, 'Risk Matrix'!$E$4:$I$4, 0)), \"\")","v":""}]
[null,null,null,null,null,null,null,{"$f":"IFERROR(INDEX('Risk Matrix'!$E$5:$I$9, MATCH(F8, 'Risk Matrix'!$B$5:$B$9, 0), MATCH(G8, 'Risk Matrix'!$E$4:$I$4, 0)), \"\")","v":""}]
[null,null,null,null,null,null,null,{"$f":"IFERROR(INDEX('Risk Matrix'!$E$5:$I$9, MATCH(F9, 'Risk Matrix'!$B$5:$B$9, 0), MATCH(G9, 'Risk Matrix'!$E$4:$I$4, 0)), \"\")","v":""}]
[null,null,null,null,null,null,null,{"$f":"IFERROR(INDEX('Risk Matrix'!$E$5:$I$9, MATCH(F10, 'Risk Matrix'!$B$5:$B$9, 0), MATCH(G10, 'Risk Matrix'!$E$4:$I$4, 0)), \"\")","v":""}]
[null,null,null,null,null,null,null,{"$f":"IFERROR(INDEX('Risk Matrix'!$E$5:$I$9, MATCH(F11, 'Risk Matrix'!$B$5:$B$9, 0), MATCH(G11, 'Risk Matrix'!$E$4:$I$4, 0)), \"\")","v":""}]
[null,null,null,null,null,null,null,{"$f":"IFERROR(INDEX('Risk Matrix'!$E$5:$I$9, MATCH(F12, 'Risk Matrix'!$B$5:$B$9, 0), MATCH(G12, 'Risk Matrix'!$E$4:$I$4, 0)), \"\")","v":""}]
[null,null,null,null,null,null,null,{"$f":"IFERROR(INDEX('Risk Matrix'!$E$5:$I$9, MATCH(F13, 'Risk Matrix'!$B$5:$B$9, 0), MATCH(G13, 'Risk Matrix'!$E$4:$I$4, 0)), \"\")","v":""}]
[null,null,null,null,null,null,null,{"$f":"IFERROR(INDEX('Risk Matrix'!$E$5:$I$9, MATCH(F14, 'Risk Matrix'!$B$5:$B$9, 0), MATCH(G14, 'Risk Matrix'!$E$4:$I$4, 0)), \"\")","v":""}]
[null,null,null,null,null,null,null,{"$f":"IFERROR(INDEX('Risk Matrix'!$E$5:$I$9, MATCH(F15, 'Risk Matrix'!$B$5:$B$9, 0), MATCH(G15, 'Risk Matrix'!$E$4:$I$4, 0)), \"\")","v":""}]
{"$rows_left_out":55}
{"sheet":"Gagnabanki - (Á)hættumat","index":2,"n_rows":54,"n_cols":8,"rows_kept":54,"cut":false,"hidden":true,"merged":[]}
[]
[null,"VERK: ",null,null,"Þátttakendur við gerð áhættumats:","Hlín Benediktsdóttir og Bjarni Reyr "]
[null,null,null,null,"Dagsetning:","2014-02-12"]
[]
[null,"Verkþáttur","Hættuflokkur","Hætta","Stutt lýsing á hættunni/ástæður hættunnar","Ráðstafanir","Ábyrgð","Leit"]
[null,null,"Fallhætta/hrunhætta","fall úr stigum/tröppum","1. Stigi/trappa gefur sig                                             2.Starfsmaður missir jafnvægið                                                     3. Stigi/trappa rennur/fellur","1. Nota viðurkennda stiga/tröppur skv. ÍST EN 131 . Sjónskoða stiga/tröppur fyrir hverja notkun.\n2. Viðhalda þriggja punkta gripi og snúa að stiga. Meta skal aðstæður hverju sinni m.t.t. veðurskilyrða.  \n3. Skoða undirlag, tryggja að það sé þétt og slétt. Stilla stiga upp með halla 1:4 og stigi nái 1m upp fyrir brún. Festa stiga efst eða halda við stigann. Stíga ekki í efsta þrep í tröppum\n",null,{"$f":"+Table10[[#This Row],[Hættuflokkur]]","v":"Fallhætta/hrunhætta"}]
[null,null,"Fallhætta/hrunhætta","fall úr vinnupöllum","Vinnupallur gefur sig og/eða vinnupallur ekki uppsettur á fullnægjandi hátt.","Vinnupallar skulu vera af viðurkenndri gerð og reistir skv. Ísl. Reglugerðum af fagaðila. Hafa skal í huga að uppfylla skilyrði um varnir á vinnupöllum. Til staðar sé handlisti (1m), hnélisti (0,5m) og fótlisti (0,15m). Festa lóðrétta stiga uppi, niðri og a.m.k. með 3 metra millibili. Trévinnupallar skulu teknir út af Vinnueftirliti Ríkisins fyrir fyrstu notkun. Sjónskoða vinnupalla fyrir hverja notkun.",null,{"$f":"+Table10[[#This Row],[Hættuflokkur]]","v":"Fallhætta/hrunhætta"}]
[null,null,"Fallhætta/hrunhætta","fall úr staurum","1. Staur gefur sig - \n2. Starfsmaður missir jafnvægið\n","1. Þar sem því er viðkomið skal nota vinnulyftu eða mannkörfu við vinnu í loftlínu. Ástandsmeta staur áður en hann er klifinn m.t.t. styrks, stöðugleika og ísingar. Nota viðurkenndan klifur og fallvarnarbúnað. \n2. Starfsmaður skal hafa hlotið fallvarna og loftlínu þjálfun áður en vinna hefst. Meta skal aðstæður hverju sinni m.t.t. veðurskilyrða. Björgunaráætlun skal vera til staðar áður en verk ef framkvæmt.\n",null,{"$f":"+Table10[[#This Row],[Hættuflokkur]]","v":"Fallhætta/hrunhætta"}]
[null,null,"Fallhætta/hrunhætta","fall úr vinnulyftum eða mannkörfum","Lyfta/spjót gefur sig","Nota viðurkenndan klifur og fallvarnarbúnað. Starfsmaður skal hafa hlotið fallvarna og loftlínu þjálfun áður en vinna hefst. Meta skal aðstæður hverju sinni m.t.t. veðurskilyrða. Björgunaráætlun skal til staðar áður en verk ef framkvæmt.",null,{"$f":"+Table10[[#This Row],[Hættuflokkur]]","v":"Fallhætta/hrunhætta"}]
[null,null,"Fallhætta/hrunhætta","fall frá brúnum/könntum (í hæð)","Starfsmaður missir jafnvægið","Halda 2m fjarlægð frá brún. Handrið skal sett ef ekki er hægt að tryggja 2m fjarlægð frá brún. Nota skal fallvarnarbúnað ef hvorki er hægt að halda 2m fjarlægð eða handrið til staðar. Nota viðurkenndan fallvarnarbúnað. Starfsmaður skal hafa hlotið fallvarna þjálfun áður en vinna hefst. Meta skal aðstæður hverju sinni m.t.t. veðurskilyrða. Björgunaráætlun skal til staðar áður en verk ef framkvæmt.",null,{"$f":"+Table10[[#This Row],[Hættuflokkur]]","v":"Fallhætta/hrunhætta"}]
[null,null,"Fallhætta/hrunhætta","fall í gryfjur/skurði","1. Brún gefur sig\n2. Starfsmaður missir jafnvægið\n3. Vegfarandi fellur í skuð\n","1. Flái/halli skal vera skv. reglum og leiðbeiningum frá vinnueftirlitinu og þeim upplýsingum sem koma fram á útgefnum teikningum. Huga skal að veðurbreytingum (frost/þíða) og gera þær ráðstafanir sem þarf til að sporna við hættuástandi.\n2. Ekki skal standa/ganga nálægt gryfju/skurðbrún. Tryggja örugga gönguleið og örugga göngubrú þar sem við á, hafa þær hreinar og greiðfærar. Göngubrýrnar skulu vera með handriði í 50cm og 1m hæð frá gólfi báðum megin á brúnni. Brúin skal ná xx cm út fyrir skurðbrún báðu megin við skurðinn á tryggu undirlagi.\n3. Séu girðingar og merkingar hannaðar fyrir verk: Fara skal eftir útgefnum teikningum og verklýsingum varðandi girðingar og merkingar frá hönnuðum                              \n3. Séu girðingar ekki sérhannaðar fyrir verk: Girða af vinnusvæði og merkja m.t.t. aðstæðna skv. reglum um Merkingu vinnusvæða og Reglur um vinnusvæðamerkingar. Fyrir öll verk gildir: Tryggja örugga gönguleið og örugga göngubrú þar sem við á, hafa þær hreinar og greiðfærar. Göngubrýrnar skulu vera með handriði í 50cm og 1m hæð frá gólfi báðum megin á brúnni. Brúin skal ná xx cm út fyrir skurðbrún báðu megin við skurðinn á tryggu undirlagi.Viðhalda merkingum og girðingum á meðan á verktíma stendur. Yfirfara þarf bæði merkingar og girðingar í lok vinnudags. Sérstaklega skal ganga frá vel um vetrartíma og þar sem illa sést til.   \n",null,{"$f":"+Table10[[#This Row],[Hættuflokkur]]","v":"Fallhætta/hrunhætta"}]
[null,null,"Fallhætta/hrunhætta","fall á janfsléttu","Starfsmaður missir jafnvægið","Halda vinnusvæðinu hreinu. Tryggja örugga og slétta gönguleiðir um vinnusvæðið. Huga skal að veðurbreytingum (hálka, snjór, rigning) og bregðast þannig við þeim að starfsmaður sé ekki í hættu á vinnusvæðinu. ",null,{"$f":"+Table10[[#This Row],[Hættuflokkur]]","v":"Fallhætta/hrunhætta"}]
[null,null,"Fallhætta/hrunhætta","hrun frá skurðbrúnum (efni)","Brún gefur sig ","Flái/halli skal vera skv. reglum og leiðbeiningum frá vinnueftirlitinu og þeim upplýsingum sem koma fram á útgefnum teikningum. Huga skal að veðurbreytingum (frost/þíða) og gera þær ráðstafanir sem þarf til að sporna við hættuástandi. Koma í veg fyrir að þungir hlutir hvíli á bakka. Efni skal vera a.m.k. 1m frá skurðbrún. Vélar og tæki skulu vera sem fjærst skurðbrún. ",null,{"$f":"+Table10[[#This Row],[Hættuflokkur]]","v":"Fallhætta/hrunhætta"}]
[null,null,"Fallhætta/hrunhætta","hrun/ fallandi hlutir eða efni","1. Lausir hlutir/verkfæri/efni of nálægt brún.\n2. Starfsmaður missir hlutir/verkfæri/efni\n3. Hlass fellur úr lyftibúnaði\n4. Hlass fellur úr gröfu, bílfarmi\n","1. Halda hlutum/verkfærum/efni sem fjærst brún. Setja upp táborð á vinnupöllum.  \n2. Tryggja/girða af svæðið fyrir neðan.\n3. Tryggja/girða af svæðið fyrir neðan. Nota viðurkenndan hífingarbúnað.Starfsmaður skal hafa hlotið viðunnandi þjálfun áður en vinna hefst. Meta skal aðstæður hverju sinni m.t.t. veðurskilyrða.\n4. Starfsmaður skal halda sig a.m.k. Xx m frá vinnuvélum\n",null,{"$f":"+Table10[[#This Row],[Hættuflokkur]]","v":"Fallhætta/hrunhætta"}]
[null,null,"Klemmihætta","Vegna handverkfæra","Starfsmaður klemmir sig vegna rangrar notkunar / beitingar verkfæra / ónýt eða léleg verkefæri","Yfirfara verkfæri áður en þau eru notuð, sjónskoða. Hlífar og öryggisbúnaður sé til staðar og í lagi á tækinu. Taka biluð/óörugg tæki úr umferð. Verkfæri teljast ekki nohæf ef öryggishlífar virka ekki. Séu vekfæri of þung skal notast við léttitæki eða fá aðstoð.",null,{"$f":"+Table10[[#This Row],[Hættuflokkur]]","v":"Klemmihætta"}]
{"$rows_left_out":40}
{"sheet":"Risk assessment bank","index":3,"n_rows":77,"n_cols":7,"rows_kept":77,"cut":false,"hidden":false,"merged":[]}
[]
["TASK","RISK","EVENT","CAUSES","ARRANGEMENTS","COMMENTS","TYPE"]
[null,"Collision","Staff or pedestrians are exposed to machinery or parts of machinery","1. Staff in the line of fire\"\n2. Work area not fenced off or markings not adequate","1. Staff must keep at least 3 m from machines (outside the line of fire/turning radius of the machine). Ensure eye contact with the machine operator.\n2. If fences and markings are designed: published drawings and project specifications regarding fencing and markings from designers must be followed. Ensure pedestrians are not in danger due to machinery and are at least 3 m from the machinery unless otherwise specified by the contractor.\nIf fences are not designed, it must be ensured that pedestrians are not in danger due to machinery and are at least 3 meters away from the machinery unless otherwise specified by the client.\n",null,"Collision"]
[null,"Collision","Staff involved in a collision","1. Inappropriate or insufficient licensing\n2. Weather conditions\n3. Speeding\n4. Vehicle malfunction\n5. Talking on a mobile phone","1. Staff must have appropriate licenses.\n2. Drive according to conditions, and use seat belts.\n3. Obey traffic rules.\n4. Preventative maintenance on vehicles. Do not use vehicles with unsafe/poor safety equipment.\n5. Use hands-free devices.\n",null,"Collision"]
[null,"Collision","Staff hit by a vehicle ","Working in traffic","Unfenced Work Area: Park the vehicle so that it shields against approaching traffic, use flashing lights, and wear high-visibility clothing with reflectors.                                                           \nFenced Work Area: Fence the work area well according to WORK AREA MARKINGS & RULES ABOUT WORKSITE MARKINGS and issue drawings and specifications if available. Create walkways and demarcate the work area to ensure the safety of walking staff.\nGeneral Guidelines for All Works: Maintain markings and fences while work is ongoing. Both markings and fences must be reviewed at the end of the workday. Special attention must be paid during the winter and in poorly visible areas.",null,"Collision"]
[null,"Collision","Pedestrians are hit by the company's vehicle","Markings on the work area are not adequate / pedestrian paths are not clear","If Fences and Markings are Not Designed: Arrange the work area and markings as specified in WORK AREA MARKINGS & RULES ABOUT WORKSITE MARKINGS.                                       \nIf Fences and Markings are Designed: Follow the issued drawings and specifications regarding fences and markings.         \nGeneral Guidelines for All Works: Maintain markings and fences while work is ongoing. Both markings and fences must be reviewed at the end of the workday. Special attention must be paid to properly securing them during winter and in poorly visible areas.",null,"Collision"]
[null,"Fall/collapse","Staff falls on a ladder or stairs","1. Ladder/stairs give way/break\n2. Foot slips                                                                                         \n3. Ladder/stairs slip/fall due to the surface","1. Use certified ladders/stairs according to ÍST EN 131. Inspect ladders/stairs before each use.\n2. Maintain three-point contact and face the ladder. Assess conditions each time for weather conditions.\n3. Examine the surface, and ensure it is firm and level. Set up the ladder at a 1:4 incline and extend the ladder 1 meter above the edge. Secure the ladder at the top or hold onto the ladder. Do not step on the top rung of the stairs.",null,"Fall/collapse"]
[null,"Fall/collapse","Staff falls off a work platform","The work platform collapses and or is not adequately set up.","Work platforms must be of a recognized type and erected according to Icelandic regulations by a professional. Consideration must be given to meeting safety requirements on work platforms. A handrail (1m), knee rail (0.5m), and toe board (0.15m) must be present. Secure vertical ladders at the top, bottom, and at least every 3 meters. Wooden work platforms must be inspected by the National Work Inspection Authority before first use. Inspect work platforms before each use.",null,"Fall/collapse"]
[null,"Fall/collapse","Staff falls from a pole","1. Pole gives way\n2. Staff loses balance","1. Where applicable, a work lift or a man basket should be used when working in an overhead line. Assess the condition of the pole before it is climbed according to strength, stability, and icing. Use approved climbing and fall protection equipment.\n2. Personnel must have received fall protection and overhead line training before work begins. The situation should be evaluated in each case concerning weather conditions. Personnel on the ground (watchman) monitor and have available a rescue plan that is jointly determined for a project.",null,"Fall/collapse"]
[null,"Fall/collapse","Staff fall from a work lift/spike or man basket","1. Lift/spear/man basket gives way\n2. A work lift or spear is driven into\n3. Staff  overreach","1. Use an approved climbing, fall protection harness and equipment. Personnel must have received fall protection and/or overhead line training before starting work. Make sure the device manager has the required permissions on the device. The situation should be evaluated in each case concerning weather conditions. Guard present. A rescue plan is prepared before work is carried out.\n2. Fence off the work area.\n3. Move the basket as needed, always standing at the bottom of the basket.",null,"Fall/collapse"]
[null,"Fall/collapse","Staff fall from an edge","1. Staff lose their balance\n2. Personnel fall over tools/soil","1. Keep a distance of 2m from the edge. A handrail must be installed if it is not possible to ensure a distance of 2 meters from the edge. A fall arrest device or a leash should be used if a distance of 2 meters cannot be maintained or a handrail is available. Use approved fall protection equipment. Personnel must have received fall protection training before starting work. The situation should be evaluated in each case concerning weather conditions. Guard present. A rescue plan must be in place before work is carried out.\n2. Keep the work area clean and remove soil if possible.",null,"Fall/collapse"]
[null,"Fall/collapse","Staff/pedestrians falls into a pit, ditch, opening","1. Edge gives way\n2. Staff lose their balance\n3. Stand too close to a ditch/pit/opening\n","1. Ensure proper slope according to design/plans or provide protective barriers. Protect against collapses using barriers or supports. For trenches up to 2 meters deep, use a slope ratio of 3:1 (horizontal to vertical). Trenches deeper than 2 meters should use a 1:1 slope ratio or employ shoring. Consider weather changes (frost/thaw) and take necessary measures to prevent hazardous conditions.\n2 - 3. Do not stand/walk near a pit/trench/edge. Mark the area, at least 1 meter away.\n2 - 3. Ensure a safe walking path and a secure footbridge where needed, keeping them clean and accessible. Handrails on footbridges should be positioned at 50 cm and 1 m heights from the floor on both sides of the bridge. The bridge must be on a secure footing on both sides of the trench walls.\n2-3. If fences and markings are designed for the work:\nFollow the issued drawings and specifications regarding fences and markings provided by the designers.                    \n2-3. \nIf fences and markings are not specifically designed for the work:\nInstall fences around the work area and mark them according to the rules on site marking and workplace marking regulations. For all works: Ensure safe walking paths and safe footbridges where applicable, keeping them clean and accessible. Footbridges should have handrails at 50 cm and 1 m height from the floor on both sides of the bridge. The bridge should be placed on a secure base on both sides of the excavation.\nMaintain markings and fences during work hours. Both markings and fences should be inspected at the end of the workday. It is particularly important to inspect thoroughly during winter and where visibility is poor.\n",null,"Fall/collapse"]
[null,"Fall/collapse","Staff falls on a flat surface","1. Staff falls on ice / loses balance\n2. Staff falls on a slippery floor / over tools / over 'clutter' / over soil","1. Ensure safe walking paths around the work area. Consider weather changes (ice, snow, rain). Wear good shoes with coarse soles, and use crampons in severe ice conditions.\n2. Keep the work area clean and accessible. Ensure that floors are not slippery.",null,"Fall/collapse"]
[null,"Fall/collapse","Staff gets material falling on them from trench edges","1. Edge gives way\n2. Heavy equipment too close to the edge","1. Proper slope/incline according to design/plan or ensure collapse prevention measures. Consider weather changes (freeze/thaw) and take necessary precautions to prevent hazardous conditions. Prevent heavy objects from resting on the edge. Material should be at least 1 meter away from the trench edge.\n2. Machines and equipment should be kept as far away from the trench edge as possible.",null,"Fall/collapse"]
[null,"Fall/collapse","Staff gets hit by tools or materials","1. Loose objects/tools/materials too close to the edge\n2. Staff working above drops objects/tools/materials\n\n","1. Keep objects/tools/materials as far away from the edge as possible. Install toe boards on scaffolding.\n2. Secure/fence off the area below.\n\n",null,"Fall/collapse"]
{"$rows_left_out":63}
{"sheet":"Importance of measures","index":4,"n_rows":33,"n_cols":15,"rows_kept":33,"cut":false,"hidden":false,"merged":[]}
[]
[]
[]
[null,null,null,null,null,null,null,null,null,null,null,null,null,null,"IMPORTANCE OF MEASURES"]
[]
[]
[]
[]
[]
[null,null,null,null,null,null,null,null,null,null,null,null,null,null,"Eliminate/remove risk"]
[]
[]
[]
[]
[]
{"$rows_left_out":19}
{"sheet":"Risk Matrix","index":5,"n_rows":9,"n_cols":9,"rows_kept":9,"cut":false,"hidden":false,"merged":[[1,0,3,0],[0,1,0,8],[1,1,1,3],[1,4,1,8],[2,2,3,2],[2,3,3,3]]}
[null,"RISK MATRIX"]
[null,"CONSEQUENCE",null,null,"LIKELIHOOD"]
[null,null,"Health                                (Mental, physical and/or social)","Personal security","Occurs less than \nevery 100 years","Occurs every \n10-100 years","Occurs every \n1-10 years","Occurs\n 1-2 times per year","Occurs more than \n2 times a year"]
[null,null,null,null,"E. Rare","D. Unlikely","C. Possible","B. Likely","A. Almost Certain"]
[null,"5. Catastrophic","Multiple fatalities or serious illnesses cause a large number of people to be unable to work.","Multiple fatalities or permanent damage to a multiple people.","High risk","Unacceptable risk","Unacceptable risk","Unacceptable risk","Unacceptable risk"]
[null,"4. Major","Single fatality or irreversible health consequences. Consequences that can cause incapacitation. A persistent chronic condition and/or very severe short-term effects.","Single fatality or irreversible damage (the person does not return to work) of one or more persons.","High risk","High risk","Unacceptable risk","Unacceptable risk","Unacceptable risk"]
[null,"3. Serious","Serious, reversible health consequences that, in most cases, include loss of work.","Absence accident/serious accident, reversible injury, or minor irreversible disability of one or more persons. Typically a lost time injury.","Moderate risk","Moderate risk","High risk","High risk","Unacceptable risk"]
[null,"2. Medium","Reversible health consequences that, in most cases, require the attention of health professionals.","Accidental injuries, reversible injuries that require treatment but have little or no effect on the individual's ability to work. Needs the attention of health professionals in most cases.","Low risk","Low risk","Moderate risk","High risk","High risk"]
[null,"1. Minor","Minor and reversible health consequences.","Minor accidents, short-term discomfort, or symptoms.","Low risk","Low risk","Low risk","Moderate risk","Moderate risk"]